payload fully implemented => now also crashes under gcc

3 jobs for fail3 in 6 minutes and 9 seconds
Status Job ID Name Coverage
  Build
failed #54457
Linux
debS_clang

00:03:08

failed #54456
Linux
debS_gcc

00:03:00

failed #54458
Windows
windows

00:02:39

 
Name Stage Failure
failed
windows Build
The following tests FAILED:
11 - correction (Failed)
15 - exportTable (Failed)
20 - run2 (Failed)
21 - run3 (Failed)
Errors while running CTest


ERROR: Job failed: exit status 1
failed
debS_clang Build
Total Test time (real) =  21.98 sec

The following tests FAILED:
11 - correction (Failed)
15 - exportTable (Failed)
20 - run2 (Failed)
21 - run3 (Failed)
Errors while running CTest
ERROR: Job failed: exit code 1
failed
debS_gcc Build
Total Test time (real) =  23.21 sec

The following tests FAILED:
11 - correction (Failed)
15 - exportTable (Failed)
20 - run2 (Failed)
21 - run3 (Failed)
Errors while running CTest
ERROR: Job failed: exit code 1