unique ptr trigSave,..

3 jobs for failed in 6 minutes and 9 seconds (queued for 1 second)
Status Job ID Name Coverage
  Build
failed #54409
Linux
debS_clang

00:03:07

failed #54408
Linux
debS_gcc

00:03:01

failed #54410
Windows
windows

00:02:39

 
Name Stage Failure
failed
windows Build
Total Test time (real) =  27.77 sec

The following tests FAILED:
15 - exportTable (Failed)
20 - run2 (Failed)
Errors while running CTest


ERROR: Job failed: exit status 1
failed
debS_clang Build
91% tests passed, 2 tests failed out of 22

Total Test time (real) = 21.43 sec

The following tests FAILED:
15 - exportTable (Failed)
20 - run2 (Failed)
Errors while running CTest
ERROR: Job failed: exit code 1
failed
debS_gcc Build
91% tests passed, 2 tests failed out of 22

Total Test time (real) = 23.47 sec

The following tests FAILED:
15 - exportTable (Failed)
20 - run2 (Failed)
Errors while running CTest
ERROR: Job failed: exit code 1